Target
Prostaglandin G/H synthase 2
Ligand
BDBM153384
Substrate
Meas. Tech.
COX1 and COX2 Inhibition Assay
pH
8±n/a
IC50
>1.00e+5±n/a nM
Comments
extracted
Citation
 Mascayano, CEspinosa, VSepúlveda-Boza, SHoobler, EKPerry, SDiaz, GHolman, TR Enzymatic Studies of Isoflavonoids as Selective and Potent Inhibitors of Human Leukocyte 5-Lipo-Oxygenase. Chem Biol Drug Des 86:114-21 (2015)  
Target
Name:
Prostaglandin G/H synthase 2
Synonyms:
COX2 Cyclooxygenase 2 (COX-2) Cyclooxygenase-2 (COX-2 AA) Cyclooxygenase-2 (COX-2) PGH2_HUMAN PHS II Prostaglandin E synthase/G/H synthase 2 Prostaglandin-endoperoxide synthase 2
Type:
Enzyme
Mol. Mass.:
69003.89
Organism:
Homo sapiens (Human)
Description:
Recombinant Cox-2 provided by Cayman (Cayman Chemical Co.,Ann Arbor, MI).
Residue:
604
  
Inhibitor
Name:
BDBM153384
Synonyms:
4-(4-fluorophenyl)-7-[[[5-[(2S)-1,1,1-trifluoro-2-hydroxybutan-2-yl]-1,3,4-oxadiazol-2-yl]amino]methyl]chromen-2-one | Setileuton
Type:
Small organic molecule
Emp. Form.:
C22H17F4N3O4
Mol. Mass.:
463.3817
SMILES:
CC[C@](O)(c1nnc(NCc2ccc3c(cc(=O)oc3c2)-c2ccc(F)cc2)o1)C(F)(F)F
: