Target
Tyrosine-protein kinase JAK3
Ligand
BDBM153657
Substrate
Meas. Tech.
Inhibition Assay
pH
7.2±n/a
Ki
102±n/a nM
Comments
extracted
Citation
 Gibbons, PHanan, ELiu, WLyssikatos, JPMagnuson, SRMendonca, RPastor, RRawson, TESiu, MZak, MZhou, AZhu, B Pyrazolopyrimidine JAK inhibitor compounds and methods US Patent  US8999998 Publication Date 4/7/2015 
Target
Name:
Tyrosine-protein kinase JAK3
Synonyms:
JAK-3 JAK3_HUMAN Janus kinase 3 (JAK3) L-JAK | Leukocyte janus kinase
Type:
Protein
Mol. Mass.:
125111.08
Organism:
Homo sapiens (Human)
Description:
P52333
Residue:
1124
  
Inhibitor
Name:
BDBM153657
Synonyms:
US8999998, 38
Type:
Small organic molecule
Emp. Form.:
C19H15N7O
Mol. Mass.:
357.3687
SMILES:
Cc1cc(NC(=O)c2cnn3cccnc23)n(n1)-c1cc(ccc1C)C#N
: