Target
Metallo-beta-lactamase VIM-2
Ligand
BDBM153698
Substrate
Meas. Tech.
Direct Competition Assay
Ki
3.7e+3± 3e+2 nM
Citation
 Mojica, MFMahler, SGBethel, CRTaracila, MAKosmopoulou, MPapp-Wallace, KMLlarrull, LIWilson, BMMarshall, SHWallace, CJVillegas, MVHarris, MEVila, AJSpencer, JBonomo, RA Exploring the Role of Residue 228 in Substrate and Inhibitor Recognition by VIM Metallo-ß-lactamases. Biochemistry 54:3183-96 (2015)  
Target
Name:
Metallo-beta-lactamase VIM-2
Synonyms:
Beta-lactamase VIM-2 | Metallo-beta-lactamase VIM-2 (VIM-2)
Type:
Protein
Mol. Mass.:
28318.00
Organism:
Pseudomonas aeruginosa (g-Proteobacteria)
Description:
Residue:
266
  
Inhibitor
Name:
BDBM153698
Synonyms:
L-CS319
Type:
Small organic molecule
Emp. Form.:
C7H11NO2S3
Mol. Mass.:
237.363
SMILES:
OC(=O)[C@@H]1CS[C@H]2CS[C@H](CS)N12
: