Target
Replicase polyprotein 1ab [1541-1855]
Ligand
BDBM31524
Substrate
Meas. Tech.
Fluorimetric Assay
pH
7.5±n/a
IC50
2.3e+2± 7e+1 nM
Comments
extracted
Citation
 Lee, HLei, HSantarsiero, BDGatuz, JLCao, SRice, AJPatel, KSzypulinski, MZOjeda, IGhosh, AKJohnson, ME Inhibitor recognition specificity of MERS-CoV papain-like protease may differ from that of SARS-CoV. ACS Chem Biol 10:1456-65 (2015)  
Target
Name:
Replicase polyprotein 1ab [1541-1855]
Synonyms:
R1AB_SARS SARS-CoV PLpro rep
Type:
Hydrolase
Mol. Mass.:
35352.30
Organism:
Human SARS coronavirus (SARS-CoV)
Description:
The SARS-CoV PLpro enzyme (residues 1541 -1855) was expressed and purified from E. coli.
Residue:
315
  
Inhibitor
Name:
BDBM31524
Synonyms:
5-amino-2-methyl-N-[(1R)-1-(naphthalen-1-yl)ethyl]benzamide (I-1) GRL0617 SARS-CoV-2 PLpro Inhibitor, GRL0617 (1) | med.21724, Compound 159
Type:
Small organic molecule
Emp. Form.:
C20H20N2O
Mol. Mass.:
304.3856
SMILES:
C[C@@H](NC(=O)c1cc(N)ccc1C)c1cccc2ccccc12
: