Target
Replicase polyprotein 1ab [1541-1855]
Ligand
BDBM50007789
Substrate
Meas. Tech.
Fluorimetric Assay
pH
7.5±n/a
IC50
9.8e+2± 9e+1 nM
Comments
extracted
Citation
 Lee, HLei, HSantarsiero, BDGatuz, JLCao, SRice, AJPatel, KSzypulinski, MZOjeda, IGhosh, AKJohnson, ME Inhibitor recognition specificity of MERS-CoV papain-like protease may differ from that of SARS-CoV. ACS Chem Biol 10:1456-65 (2015)  
Target
Name:
Replicase polyprotein 1ab [1541-1855]
Synonyms:
R1AB_SARS SARS-CoV PLpro rep
Type:
Hydrolase
Mol. Mass.:
35352.30
Organism:
Human SARS coronavirus (SARS-CoV)
Description:
The SARS-CoV PLpro enzyme (residues 1541 -1855) was expressed and purified from E. coli.
Residue:
315
  
Inhibitor
Name:
BDBM50007789
Synonyms:
CHEMBL1173044 N-(2H-1,3-benzodioxol-5-ylmethyl)-1-[(1R)-1-(naphthalen-1-yl)ethyl]piperidine-4-carboxamide (I-3) | med.21724, Compound 165
Type:
Small organic molecule
Emp. Form.:
C26H28N2O3
Mol. Mass.:
416.5121
SMILES:
C[C@@H](N1CCC(CC1)C(=O)NCc1ccc2OCOc2c1)c1cccc2ccccc12
: