Target
Beta-secretase 1
Ligand
BDBM155109
Substrate
Meas. Tech.
TR-FRET Assay
pH
2.5±n/a
IC50
3700±n/a nM
Comments
extracted
Citation
 Karlstrom, SCsjernyik, GSwahn, BSandberg, LKolmodin, KSoderman, POhberg, L 2H-imidazol-4-amine compounds and their use as BACE inhibitors US Patent  US9000182 Publication Date 4/7/2015 
Target
Name:
Beta-secretase 1
Synonyms:
ASP2 Aspartyl protease 2 BACE1 Beta-secretase (BACE) Beta-secretase 1 (BACE 1) Beta-secretase 1 (BACE1) Beta-site amyloid precursor protein cleaving enzyme 1 Memapsin-2 beta-Secretase (BACE-1) | beta-Secretase (BACE1)
Type:
Protein
Mol. Mass.:
55755.10
Organism:
Homo sapiens (Human)
Description:
P56817
Residue:
501
  
Inhibitor
Name:
BDBM155109
Synonyms:
US9000182, 16
Type:
Small organic molecule
Emp. Form.:
C20H26BrN3O
Mol. Mass.:
404.344
SMILES:
CC(C)O[C@H]1CC[C@@]2(Cc3ccc(Br)cc3C22N=C(C)C(N)=N2)CC1
: