Target
Beta-secretase 1
Ligand
BDBM155116
Substrate
Meas. Tech.
Diluted TR-FRET Assay
pH
2.5±n/a
IC50
15±n/a nM
Comments
extracted
Citation
 Karlstrom, SSoderman, PRakos, LOhberg, LKolmodin, KSandberg, L Cyclohexane-1,2′-indene-1′,2″-imidazol compounds and their use as BACE inhibitors US Patent  US9000183 Publication Date 4/7/2015 
Target
Name:
Beta-secretase 1
Synonyms:
ASP2 Aspartyl protease 2 BACE1 Beta-secretase (BACE) Beta-secretase 1 (BACE 1) Beta-secretase 1 (BACE1) Beta-site amyloid precursor protein cleaving enzyme 1 Memapsin-2 beta-Secretase (BACE-1) | beta-Secretase (BACE1)
Type:
Protein
Mol. Mass.:
55755.10
Organism:
Homo sapiens (Human)
Description:
P56817
Residue:
501
  
Inhibitor
Name:
BDBM155116
Synonyms:
US9000183, 2
Type:
Small organic molecule
Emp. Form.:
C27H30N4O
Mol. Mass.:
426.5533
SMILES:
CO[C@H]1CC[C@@]2(Cc3cc(C)c(cc3C22N=C(C)C(N)=N2)-c2cncc(c2)C#CC)CC1
: