Target
Beta-secretase 1
Ligand
BDBM155129
Substrate
Meas. Tech.
TR-FRET Assay
pH
2.5±n/a
IC50
130±n/a nM
Comments
extracted
Citation
 Karlstrom, SSandberg, LSoderman, PKolmodin, KOhberg, L Cyclohexane-1,2′-naphthalene-1′,2″-imidazol compounds and their use as BACE inhibitors US Patent  US9000184 Publication Date 4/7/2015 
Target
Name:
Beta-secretase 1
Synonyms:
ASP2 Aspartyl protease 2 BACE1 Beta-secretase (BACE) Beta-secretase 1 (BACE 1) Beta-secretase 1 (BACE1) Beta-site amyloid precursor protein cleaving enzyme 1 Memapsin-2 beta-Secretase (BACE-1) | beta-Secretase (BACE1)
Type:
Protein
Mol. Mass.:
55755.10
Organism:
Homo sapiens (Human)
Description:
P56817
Residue:
501
  
Inhibitor
Name:
BDBM155129
Synonyms:
US9000184, 3
Type:
Small organic molecule
Emp. Form.:
C21H19F2N3
Mol. Mass.:
351.3925
SMILES:
CC1=NC2(N=C1N)c1cc(ccc1CCC21CC1)-c1cc(F)cc(F)c1
: