Target
Sodium/glucose cotransporter 2
Ligand
BDBM50353883
Substrate
Meas. Tech.
In Vitro Assay
pH
7.4±n/a
Temperature
310.15±n/a K
IC50
27.5±n/a nM
Comments
extracted
Citation
 Lee, JSong, KLee, SH Thiophene derivative as SGLT2 inhibitor and pharmaceutical composition comprising same US Patent  US9006187 Publication Date 4/14/2015 
Target
Name:
Sodium/glucose cotransporter 2
Synonyms:
Na(+)/glucose cotransporter 2 SGLT2 Sodium-Dependent Glucose Cotransporter 2 (SGLT2) Solute carrier family 5 member 2
Type:
Protein
Mol. Mass.:
72902.00
Organism:
Homo sapiens (Human)
Description:
P31639
Residue:
672
  
Inhibitor
Name:
BDBM50353883
Synonyms:
CHEMBL1829079 | US9006187, 22
Type:
Small organic molecule
Emp. Form.:
C21H26O6S
Mol. Mass.:
406.493
SMILES:
Cc1sc(cc1Cc1ccc(OCC=C)cc1)[C@@H]1O[C@H](CO)[C@@H](O)[C@H](O)[C@H]1O
: