Target
3-hydroxy-3-methylglutaryl-coenzyme A reductase
Ligand
BDBM155389
Substrate
Meas. Tech.
Reductase Assay
pH
7.2±n/a
IC50
1±n/a nM
Comments
extracted
Citation
 Lindsay, DJackson, PHindley, SBhamra, I Rosuvastatin and atorvastatin derivatives US Patent  US9006282 Publication Date 4/14/2015 
Target
Name:
3-hydroxy-3-methylglutaryl-coenzyme A reductase
Synonyms:
HMDH_RAT Hmgcr
Type:
Enzyme
Mol. Mass.:
96689.85
Organism:
Rattus norvegicus (rat)
Description:
Isolated rat liver microsomes were used as enzyme source.
Residue:
887
  
Inhibitor
Name:
BDBM155389
Synonyms:
US9006282, Example 3, Compound 8
Type:
Small organic molecule
Emp. Form.:
C43H45FN2O4
Mol. Mass.:
672.8268
SMILES:
CC(C)c1c(C(=O)Nc2ccccc2)c(c(-c2ccc(F)cc2)n1CC[C@@H]1C[C@H](CC(OCC=C)O1)OCc1ccccc1)-c1ccccc1
: