Target
Methyl-CpG-binding protein 2
Ligand
BDBM158511
Substrate
Meas. Tech.
Binding Assay
IC50
33900±n/a nM
Citation
 Nelson, WGYegnasubramanian, SLin, XSpeed, TJReichert, Z Agents for reversing epigenetic silencing of genes US Patent  US9034574 Publication Date 5/19/2015 
Target
Name:
Methyl-CpG-binding protein 2
Synonyms:
MECP2 Small conductance calcium-activated potassium channel protein 3
Type:
Mol. Mass.:
52482.84
Organism:
Homo sapiens (Human)
Description:
P51608
Residue:
486
  
Inhibitor
Name:
BDBM158511
Synonyms:
US9034574, XXI
Type:
Small organic molecule
Emp. Form.:
C14H11ClN2S
Mol. Mass.:
274.769
SMILES:
Clc1ccc(cc1)C1NN=C(S1)c1ccccc1
: