Target
2-acylglycerol O-acyltransferase 2
Ligand
BDBM159741
Substrate
Meas. Tech.
Inhibition Assay
Temperature
298.15±n/a K
IC50
34±n/a nM
Comments
extracted
Citation
 Busujima, TOi, TTanaka, HShirasaki, YIwakiri, KSato, NTokita, S Nitrogen-containing condensed heterocyclic compound US Patent  US9035059 Publication Date 5/19/2015 
Target
Name:
2-acylglycerol O-acyltransferase 2
Synonyms:
2-acylglycerol O-acyltransferase 2 Acyl-CoA:monoacylglycerol acyltransferase 2 (MOGAT2) DGAT2L5 Diacylglycerol acyltransferase 2-like protein 5 MOGAT2 Monoacylglycerol Acyltransferase 2 (MGAT2) hDC5 | hMGAT2
Type:
Enzyme
Mol. Mass.:
38210.80
Organism:
Homo sapiens (Human)
Description:
Q3SYC2
Residue:
334
  
Inhibitor
Name:
BDBM159741
Synonyms:
US9035059, 24-7/24-8
Type:
Small organic molecule
Emp. Form.:
C33H43FN4O2S
Mol. Mass.:
578.784
SMILES:
CC(N1CCc2cc(ccc2C1)S(=O)(=O)Nc1ccc(CCCC2CCCC2)cc1F)c1cnc(nc1)C(C)(C)C
: