Target
Melanocortin receptor 4
Ligand
BDBM160247
Substrate
Meas. Tech.
Competitive Inhibition Assay
pH
7.5±n/a
Temperature
310.15±n/a K
Ki
1±n/a nM
Comments
extracted
Citation
 Dodd, JHShi, YYang, W Melanocortin receptor-specific peptides US Patent  US9040663 Publication Date 5/26/2015 
Target
Name:
Melanocortin receptor 4
Synonyms:
MC4-R MC4R_HUMAN Melanocortin receptor 4 (MC-4) Melanocortin receptor 4 (MC4R)
Type:
Enzyme
Mol. Mass.:
36949.50
Organism:
Homo sapiens (Human)
Description:
P32245
Residue:
332
  
Inhibitor
Name:
BDBM160247
Synonyms:
US9040663, 93
Type:
Small organic molecule
Emp. Form.:
C50H70N18O10
Mol. Mass.:
1083.2054
SMILES:
CC(=O)N[C@@H](CCCNC(N)=N)C(=O)N[C@H]1CCCCNC(=O)C[C@H](NC(=O)[C@H](Cc2c[nH]c3ccccc23)NC(=O)[C@H](CCCNC(N)=N)NC(=O)[C@@H](Cc2ccc(cc2)C#N)NC(=O)[C@H](CCC(N)=O)NC1=O)C(N)=O
: