Target
TGF-beta receptor type-1
Ligand
BDBM36355
Substrate
Meas. Tech.
Kinase Assay
IC50
1578.003±n/a nM
Citation
 Hong, CCHopkins, CRHatzopoulos, AKLindsley, CWHao, J Compounds and methods useful for directing stem cell differentiation US Patent  US9040694 Publication Date 5/26/2015 
Target
Name:
TGF-beta receptor type-1
Synonyms:
ALK-5 Activin A receptor type II-like protein kinase of 53kD SKR4 TGF-beta receptor type I TGFBR1 TGFR1_HUMAN Transforming growth factor-beta receptor type I
Type:
enzyme
Mol. Mass.:
55968.24
Organism:
Homo sapiens (Human)
Description:
P36897
Residue:
503
  
Inhibitor
Name:
BDBM36355
Synonyms:
4-(2-(4-(3-(quinolin-4-yl)pyrazolo[1,5-a]pyrimidin-6-yl)phenoxy)ethyl)morpholine US9040694, 2
Type:
Small organic molecule
Emp. Form.:
C27H25N5O2
Mol. Mass.:
451.5197
SMILES:
C(CN1CCOCC1)Oc1ccc(cc1)-c1cnc2c(cnn2c1)-c1ccnc2ccccc12
: