Target
TGF-beta receptor type-1
Ligand
BDBM36356
Substrate
Meas. Tech.
Kinase Assay
IC50
998.99±n/a nM
Citation
 Hong, CCHopkins, CRHatzopoulos, AKLindsley, CWHao, J Compounds and methods useful for directing stem cell differentiation US Patent  US9040694 Publication Date 5/26/2015 
Target
Name:
TGF-beta receptor type-1
Synonyms:
ALK-5 Activin A receptor type II-like protein kinase of 53kD SKR4 TGF-beta receptor type I TGFBR1 TGFR1_HUMAN Transforming growth factor-beta receptor type I
Type:
enzyme
Mol. Mass.:
55968.24
Organism:
Homo sapiens (Human)
Description:
P36897
Residue:
503
  
Inhibitor
Name:
BDBM36356
Synonyms:
DMH3 US9040694, 3
Type:
Small organic molecule
Emp. Form.:
C26H25N5O
Mol. Mass.:
423.5096
SMILES:
CN(C)CCCOc1ccc(cc1)-c1cnc2c(cnn2c1)-c1ccnc2ccccc12
: