Target
5-hydroxytryptamine receptor 3A
Ligand
BDBM160733
Substrate
Meas. Tech.
Radioligand Binding Assay
pH
7.5±n/a
Temperature
298.15±n/a K
Ki
217±n/a nM
Comments
extracted
Citation
 Guzzo, PRManning, DDEarley, W 5-HT3 receptor modulators, methods of making, and use thereof US Patent  US9045501 Publication Date 6/2/2015 
Target
Name:
5-hydroxytryptamine receptor 3A
Synonyms:
5-HT-3 5-HT3A 5-hydroxytryptamine receptor 3 (5-HT3) 5-hydroxytryptamine receptor 3A (5HT3A) 5HT3R HTR3A Serotonin 3 receptor (5HT3) Serotonin-gated ion channel receptor | Serotonin-gated ion channel receptor 3
Type:
Protein
Mol. Mass.:
55283.27
Organism:
Homo sapiens (Human)
Description:
P46098
Residue:
478
  
Inhibitor
Name:
BDBM160733
Synonyms:
US9045501, 30 (Enant. A) | US9045501, 31 (Enant. B)
Type:
Small organic molecule
Emp. Form.:
C17H20N4O
Mol. Mass.:
296.3669
SMILES:
O=C1N(CC2CN3CCC2CC3)Cc2n[nH]c3cccc1c23
: