Target
Fibroblast growth factor receptor 2
Ligand
BDBM161453
Substrate
Meas. Tech.
Inhibition Assay
pH
7.5±n/a
Temperature
298.15±n/a K
IC50
<0.3±n/a nM
Comments
extracted
Citation
 Sagara, TIto, SOtsuki, SSootome, H 3,5-disubstituted alkynylbenzene compound and salt thereof US Patent  US9108973 Publication Date 8/18/2015 
Target
Name:
Fibroblast growth factor receptor 2
Synonyms:
BEK FGFR-2 FGFR2 Fibroblast growth factor receptor 2 (FGFR2) KGFR Keratinocyte growth factor receptor VEGF-receptor 2 and Fibroblast growth factor receptor 2
Type:
Enzyme
Mol. Mass.:
92015.45
Organism:
Homo sapiens (Human)
Description:
P21802
Residue:
821
  
Inhibitor
Name:
BDBM161453
Synonyms:
US10124003, Ex. Compound 66 US9108973, 66
Type:
Small organic molecule
Emp. Form.:
C25H25N5O5
Mol. Mass.:
475.4965
SMILES:
COC(=O)[C@@H]1C[C@@H](CN1C(=O)C=C)n1cc(C#Cc2cc(OC)cc(OC)c2)c2c(N)ncnc12
: