Target
Hepatocyte growth factor receptor
Ligand
BDBM164428
Substrate
Meas. Tech.
In Vitro Assay
pH
8±n/a
Temperature
300.15±n/a K
Ki
22.9±n/a nM
Comments
extracted
Citation
 Albrecht, BKBauer, DBellon, SBode, CMBooker, SBoezio, AChoquette, DD'Amico, DHarmange, JHirai, SHungate, RWKim, TLewis, RTLiu, LLohman, JWNorman, MHPotashman, MSiegmund, ACSpringer, SKStec, MXi, NYang, K Fused heterocyclic derivatives and methods of use US Patent  US9066954 Publication Date 6/30/2015 
Target
Name:
Hepatocyte growth factor receptor
Synonyms:
Hepatocyte growth factor receptor Hepatocyte growth factor receptor (c-MET) MET Met proto-oncogene (hepatocyte growth factor receptor) Tyrosine-protein kinase Met (c-Met) c-Met kinase
Type:
Protein
Mol. Mass.:
155559.73
Organism:
Homo sapiens (Human)
Description:
P08581
Residue:
1390
  
Inhibitor
Name:
BDBM164428
Synonyms:
US9066954, 70
Type:
Small organic molecule
Emp. Form.:
C20H14N6O
Mol. Mass.:
354.3648
SMILES:
O=c1[nH]cnc2ccc(Cc3nnc4ccc(nn34)-c3ccccc3)cc12
: