Target
Hepatocyte growth factor receptor
Ligand
BDBM164448
Substrate
Meas. Tech.
In Vitro Assay
pH
8±n/a
Temperature
300.15±n/a K
Ki
9.2±n/a nM
Comments
extracted
Citation
 Albrecht, BKBauer, DBellon, SBode, CMBooker, SBoezio, AChoquette, DD'Amico, DHarmange, JHirai, SHungate, RWKim, TLewis, RTLiu, LLohman, JWNorman, MHPotashman, MSiegmund, ACSpringer, SKStec, MXi, NYang, K Fused heterocyclic derivatives and methods of use US Patent  US9066954 Publication Date 6/30/2015 
Target
Name:
Hepatocyte growth factor receptor
Synonyms:
Hepatocyte growth factor receptor Hepatocyte growth factor receptor (c-MET) MET Met proto-oncogene (hepatocyte growth factor receptor) Tyrosine-protein kinase Met (c-Met) c-Met kinase
Type:
Protein
Mol. Mass.:
155559.73
Organism:
Homo sapiens (Human)
Description:
P08581
Residue:
1390
  
Inhibitor
Name:
BDBM164448
Synonyms:
US9066954, 148
Type:
Small organic molecule
Emp. Form.:
C19H13N5OS
Mol. Mass.:
359.404
SMILES:
C(Oc1ccnc2ccccc12)c1nnc2ccc(nn12)-c1cccs1
: