Target
Cyclin-dependent kinase 9
Ligand
BDBM164883
Substrate
Meas. Tech.
In Vitro Kinase Inhibition Assay
pH
7.5±n/a
IC50
3±n/a nM
Comments
extracted
Citation
 Zeitlmann, LNiestroj, AHeiser, U Inhibitors of protein kinases US Patent  US9067888 Publication Date 6/30/2015 
Target
Name:
Cyclin-dependent kinase 9
Synonyms:
C-2K CDK9 Cell division cycle 2-like protein kinase 4 Cyclin-Dependent Kinase 9 (CDK9) Serine/threonine-protein kinase PITALRE Tat-associated kinase complex catalytic subunit
Type:
Enzyme Subunit
Mol. Mass.:
42789.13
Organism:
Homo sapiens (Human)
Description:
Residue:
372
  
Inhibitor
Name:
BDBM164883
Synonyms:
US9067888, 33
Type:
Small organic molecule
Emp. Form.:
C21H24FN3O3
Mol. Mass.:
385.432
SMILES:
COc1cc(F)ccc1-c1ccnc(NC(=O)[C@H]2CCC[C@H](C2)NC(C)=O)c1
: