Target
Poly [ADP-ribose] polymerase 1
Ligand
BDBM167421
Substrate
Meas. Tech.
Displacement Assay
Kd
<10±n/a nM
Citation
 Papeo, GMBorghi, DCaruso, MPosteri, HKrasavin, MY 3-Oxo-2,3-dihydro-1H-indazole-4-carboxamide derivatives as PARP-1 inhibitors US Patent  US9073893 Publication Date 7/7/2015 
Target
Name:
Poly [ADP-ribose] polymerase 1
Synonyms:
(ARTD1 or PARP1) 2.4.2.30 ADPRT ARTD1 Human diphtheria toxin-like ADP-ribosyltransferase (ARTD1 or PARP1) NT-PARP-1 PARP1 PPOL Poly [ADP-ribose] polymerase 1 (PARP) Poly [ADP-ribose] polymerase 1 (PARP1) Poly [ADP-ribose] polymerase 1, 28-kDa form Poly [ADP-ribose] polymerase 1, processed C-terminus Poly [ADP-ribose] polymerase-1 Poly(ADP-ribose) polymerase-1 (ARTD1/PARP1) Protein poly-ADP-ribosyltransferase PARP1 | Synonyms=ADPRT
Type:
Mol. Mass.:
113114.22
Organism:
Homo sapiens (Human)
Description:
P09874
Residue:
1014
  
Inhibitor
Name:
BDBM167421
Synonyms:
US9073893, 21
Type:
Small organic molecule
Emp. Form.:
C14H17FN4O2
Mol. Mass.:
292.3088
SMILES:
Cn1n(C2CCNCC2)c(=O)c2c(cc(F)cc12)C(N)=O
: