Target
Acetylcholinesterase
Ligand
BDBM8960
Substrate
Meas. Tech.
AChE and BChE Inhibition Assay
pH
8±n/a
Temperature
298.15±n/a K
IC50
32± 3 nM
Comments
extracted
Citation
 Hameed, AZehra, STShah, SJKhan, KMAlharthy, RDFurtmann, NBajorath, JTahir, MNIqbal, J Syntheses, cholinesterases inhibition, and molecular docking studies of pyrido[2,3-b]pyrazine derivatives. Chem Biol Drug Des 86:1115-20 (2015)  
Target
Name:
Acetylcholinesterase
Synonyms:
ACES_ELEEL Acetylcholinesterase (EeAChE) | ache
Type:
Enzyme
Mol. Mass.:
71812.79
Organism:
Electrophorus electricus (Electric eel)
Description:
Residue:
633
  
Inhibitor
Name:
BDBM8960
Synonyms:
(+/-)-2-[(1-benzylpiperidin-4-yl)methyl]-5,6-dimethoxy-indan-1-one Aricept CHEMBL1678 CHEMBL502 Donepezil E2020 US9346818, DPH US9663465, Donepezil
Type:
Small organic molecule
Emp. Form.:
C24H29NO3
Mol. Mass.:
379.492
SMILES:
COc1cc2CC(CC3CCN(Cc4ccccc4)CC3)C(=O)c2cc1OC
: