Target
Oxysterols receptor LXR-alpha
Ligand
BDBM168119
Substrate
Meas. Tech.
Radioligand Binding Assay
Temperature
298.15±n/a K
Ki
46±n/a nM
Comments
extracted
Citation
 Leftheris, KZhuang, L Liver X receptor modulators US Patent  US9073931 Publication Date 7/7/2015 
Target
Name:
Oxysterols receptor LXR-alpha
Synonyms:
LXRA Liver X receptor alpha Liver X receptor alpha (NR1H3) NR1H3 Nuclear orphan receptor LXR-alpha | Nuclear receptor subfamily 1 group H member 3
Type:
Enzyme Catalytic Domain
Mol. Mass.:
50403.85
Organism:
Homo sapiens (Human)
Description:
Q13133
Residue:
447
  
Inhibitor
Name:
BDBM168119
Synonyms:
US9073931, E26
Type:
Small organic molecule
Emp. Form.:
C22H24F3N5O4S
Mol. Mass.:
511.517
SMILES:
CC(C)C1N(CCn2c1nc1cc(CO)c(cc21)S(C)(=O)=O)c1ncc(C(C)=O)c(n1)C(F)(F)F
: