Target
Oxysterols receptor LXR-beta
Ligand
BDBM168098
Substrate
Meas. Tech.
Radioligand Binding Assay
Temperature
298.15±n/a K
Ki
240±n/a nM
Comments
extracted
Citation
 Leftheris, KZhuang, L Liver X receptor modulators US Patent  US9073931 Publication Date 7/7/2015 
Target
Name:
Oxysterols receptor LXR-beta
Synonyms:
LXRB Liver X, LXR beta NR1H2 Nuclear receptor NER Ubiquitously-expressed nuclear receptor
Type:
Enzyme Catalytic Domain
Mol. Mass.:
50978.79
Organism:
Homo sapiens (Human)
Description:
P55055
Residue:
460
  
Inhibitor
Name:
BDBM168098
Synonyms:
US9073931, E15a | US9073931, E29a
Type:
Small organic molecule
Emp. Form.:
C21H23F3N6O4S
Mol. Mass.:
512.505
SMILES:
CC(C)[C@H]1N(CCn2c1nc1cc(CO)c(cc21)S(C)(=O)=O)c1ncc(C(N)=O)c(n1)C(F)(F)F
: