Target
Sodium-dependent noradrenaline transporter
Ligand
BDBM170440
Substrate
Meas. Tech.
Binding Assay
pH
7.4±n/a
Ki
1.2±n/a nM
Comments
extracted
Citation
 Molino, BFLiu, SGuzzo, PRBeck, JP Aryl- and heteroaryl-substituted tetrahydroisoquinolines and use thereof to block reuptake of norepinephrine, dopamine, and serotonin US Patent  US9085531 Publication Date 7/21/2015 
Target
Name:
Sodium-dependent noradrenaline transporter
Synonyms:
Monoamine transporter NET Noradrenaline Transporter (NET) Norepinephrine transporter protein (NET) SLC6A2 Sodium-dependent noradrenaline transporter (NET) | Solute carrier family 6 member 2
Type:
Multi-pass membrane protein
Mol. Mass.:
69337.72
Organism:
Homo sapiens (Human)
Description:
P23975
Residue:
617
  
Inhibitor
Name:
BDBM170440
Synonyms:
US9085531, 40
Type:
Small organic molecule
Emp. Form.:
C18H17NS
Mol. Mass.:
279.399
SMILES:
CN1CC(c2ccc3sccc3c2)c2ccccc2C1
: