Target
Protease
Ligand
BDBM171366
Substrate
Meas. Tech.
Inhibition Assay
Ki
100±n/a nM
Citation
 Ghosh, AK Nonpeptide HIV-1 protease inhibitors US Patent  US9085571 Publication Date 7/21/2015 
Target
Name:
Protease
Synonyms:
Type:
Enzyme
Mol. Mass.:
10904.79
Organism:
Human immunodeficiency virus 1 (HIV-1)
Description:
Q9YQ12
Residue:
99
  
Inhibitor
Name:
BDBM171366
Synonyms:
US9085571, Table 1, Compound 14
Type:
Small organic molecule
Emp. Form.:
C38H56N4O4
Mol. Mass.:
632.8756
SMILES:
CCCN(CCC)C(=O)c1cccc(c1)C(=O)N[C@@H](Cc1ccccc1)[C@H](O)CN1C[C@H]2CCCC[C@H]2C[C@H]1C(=O)NC(C)(C)C
: