Target
Protease
Ligand
BDBM171377
Substrate
Meas. Tech.
Inhibition Assay
Ki
100±n/a nM
Citation
 Ghosh, AK Nonpeptide HIV-1 protease inhibitors US Patent  US9085571 Publication Date 7/21/2015 
Target
Name:
Protease
Synonyms:
Type:
Enzyme
Mol. Mass.:
10904.79
Organism:
Human immunodeficiency virus 1 (HIV-1)
Description:
Q9YQ12
Residue:
99
  
Inhibitor
Name:
BDBM171377
Synonyms:
US9085571, Table 1, Compound 25
Type:
Small organic molecule
Emp. Form.:
C36H45N5O7S
Mol. Mass.:
691.837
SMILES:
COc1ccc(cc1)S(=O)(=O)N(CC(C)C)C[C@@H](O)[C@H](Cc1ccccc1)NC(=O)c1cc(N)cc(c1)C(=O)N(C)Cc1nc(C)oc1C
: