Target
Sodium-dependent dopamine transporter
Ligand
BDBM172725
Substrate
Meas. Tech.
Radioligand Binding Assay
Ki
1.5±n/a nM
Citation
 Bhat, LAdiey, K Methods of using cycloalkylmethylamine derivatives US Patent  US9096515 Publication Date 8/4/2015 
Target
Name:
Sodium-dependent dopamine transporter
Synonyms:
DA transporter DAT1 Dopamine transporter protein (DAT) SC6A3_HUMAN Sodium-dependent dopamine transporter Solute carrier family 6 member 3
Type:
Multi-pass membrane protein
Mol. Mass.:
68497.11
Organism:
Homo sapiens (Human)
Description:
Q01959
Residue:
620
  
Inhibitor
Name:
BDBM172725
Synonyms:
US9096515, 33a -Racemic
Type:
Small organic molecule
Emp. Form.:
C19H28Cl2N2O
Mol. Mass.:
371.344
SMILES:
CC(CCNCCCC(N)=O)CC1(CCC1)c1ccc(Cl)c(Cl)c1
: