Target
Potassium-transporting ATPase alpha chain 1
Ligand
BDBM50155436
Substrate
Meas. Tech.
High Throughput Screening Assay
pH
7.4±n/a
Temperature
310.15±n/a K
IC50
65000±n/a nM
Comments
extracted
Citation
 Xie, ZShapiro, JISi, SZhang, Z Na/K-ATPase ligands, ouabain antagonists, assays and uses thereof US Patent  US9114126 Publication Date 8/25/2015 
Target
Name:
Potassium-transporting ATPase alpha chain 1
Synonyms:
ATP4A Gastric H(+)/K(+) ATPase subunit alpha Na/K-ATPase Potassium-transporting ATPase alpha chain 1 | Proton pump
Type:
Enzyme
Mol. Mass.:
114279.23
Organism:
Sus scrofa (Pig)
Description:
P19156
Residue:
1034
  
Inhibitor
Name:
BDBM50155436
Synonyms:
1,3,5-Trihydroxy-xanthen-9-one US9114126, MB3 | Xanthen-9-one, 1.4
Type:
Small organic molecule
Emp. Form.:
C13H8O5
Mol. Mass.:
244.1996
SMILES:
Oc1cc(O)c2c(c1)oc1c(O)cccc1c2=O
: