Target
Dipeptidyl peptidase 4
Ligand
BDBM50135065
Substrate
Meas. Tech.
In Vitro Enzyme Assay
pH
4±n/a
IC50
2000±0 nM
Comments
extracted
Citation
 Yang, CLi, W Dipeptidyl-peptidase-IV inhibitors for treatment of type 2 diabetes complex with hypertension US Patent  US9115082 Publication Date 8/25/2015 
Target
Name:
Dipeptidyl peptidase 4
Synonyms:
ADABP Adenosine deaminase complexing protein 2 CD_antigen=CD26 DPP4 DPPIV Dipeptidyl peptidase 4 (DPP IV) Dipeptidyl peptidase 4 (DPP4) Dipeptidyl peptidase 4 membrane form Dipeptidyl peptidase IV Dipeptidyl peptidase IV (DDP-IV) Dipeptidyl peptidase IV membrane form Dipeptidyl peptidase-IV (DPP-4) T-cell activation antigen CD26 | TP103
Type:
Enzyme
Mol. Mass.:
88271.01
Organism:
Homo sapiens (Human)
Description:
P27487
Residue:
766
  
Inhibitor
Name:
BDBM50135065
Synonyms:
2-Amino-3-methyl-1-pyrrolidin-1-yl-pentan-1-one US9115082, 10
Type:
Small organic molecule
Emp. Form.:
C10H20N2O
Mol. Mass.:
184.2786
SMILES:
CCC(C)C(N)C(=O)N1CCCC1
: