Target
MAP kinase-activated protein kinase 5
Ligand
BDBM175242
Substrate
Meas. Tech.
IMAP Assay
pH
7.5±n/a
IC50
8.1e+3±n/a nM
Comments
extracted
Citation
 Hockerman, SLMonahan, JBSelness, SR Methyl/fluoro-pyridinyl-methoxy substituted pyridinone-pyridinyl compounds and fluoro-pyrimidinyl-methoxy substituted pyridinone-pyridinyl compounds US Patent  US9115089 Publication Date 8/25/2015 
Target
Name:
MAP kinase-activated protein kinase 5
Synonyms:
MAP kinase-activated protein kinase 5 (PRAK) MAPK-activated protein kinase 5 MAPKAP kinase 5 PRAK p38-regulated/activated protein kinase (PRAK)
Type:
Serine/threonine-protein kinase
Mol. Mass.:
54229.92
Organism:
Homo sapiens (Human)
Description:
Recombinant MAPKAPK5 was phosphorylated by incubation with active p38alpha before assays.
Residue:
473
  
Inhibitor
Name:
BDBM175242
Synonyms:
US11844801, Compound (M)-I | US9115089, 49
Type:
Small organic molecule
Emp. Form.:
C25H22ClF2N5O3
Mol. Mass.:
513.924
SMILES:
Cc1cnc(cc1-n1c(C)cc(OCc2ncc(F)cc2F)c(Cl)c1=O)-c1ccnc(n1)C(C)(C)O
: