Target
3-hydroxy-3-methylglutaryl-coenzyme A reductase
Ligand
BDBM34168
Substrate
Meas. Tech.
Reductase Activity Assay
pH
7.4±n/a
IC50
29.5±3.5 nM
Comments
extracted
Citation
 Lin, JChen, CFang, JChen, JChern, TWei, T Dual action inhibitors against histone deacetylases and 3-hydroxy-3-methylglutaryl coenzyme a reductase US Patent  US9115116 Publication Date 8/25/2015 
Target
Name:
3-hydroxy-3-methylglutaryl-coenzyme A reductase
Synonyms:
3-hydroxy-3-methylglutaryl-coenzyme A (HMG-CoA) reductase HMDH_HUMAN HMG-CoA reductase (HMGR) | HMGCR
Type:
Enzyme
Mol. Mass.:
97477.10
Organism:
Homo sapiens (Human)
Description:
P04035
Residue:
888
  
Inhibitor
Name:
BDBM34168
Synonyms:
LOVASTATIN SMR000058779 US9353061, Lovastatina | cid_53232
Type:
Small organic molecule
Emp. Form.:
C24H36O5
Mol. Mass.:
404.5396
SMILES:
CC[C@H](C)C(=O)O[C@H]1C[C@@H](C)C=C2C=C[C@H](C)[C@H](CC[C@@H]3C[C@@H](O)CC(=O)O3)[C@@H]12
: