Target
ALK tyrosine kinase receptor [L1196M]
Ligand
BDBM175250
Substrate
Meas. Tech.
In Vitro Inhibition Assay
IC50
2±n/a nM
Citation
 Carry, JChatreaux, FDeprets, SDuclos, OLeroy, VMallart, SMelon-Manguer, DMendez-Perez, MVergne, F Thienopyrimidine derivatives, processes for the preparation thereof and therapeutic uses thereof US Patent  US9115140 Publication Date 8/25/2015 
Target
Name:
ALK tyrosine kinase receptor [L1196M]
Synonyms:
ALK ALK tyrosine kinase receptor (ALK) (L1196M) ALK tyrosine kinase receptor (L1196M) Anaplastic lymphoma kinase L1196M (ALK L1196M) | Tyrosine-protein kinase receptor [L1196M]
Type:
Mol. Mass.:
176471.13
Organism:
Homo sapiens (Human)
Description:
Q9UM73[L1196M]
Residue:
1620
  
Inhibitor
Name:
BDBM175250
Synonyms:
US9115140, I-118
Type:
Small organic molecule
Emp. Form.:
C30H36N6O3S
Mol. Mass.:
560.71
SMILES:
COc1ccccc1-c1c(sc2cnc(Nc3cc(C)c(cc3OC(C)C)N3CCC(C3)N(C)C)nc12)C(N)=O
: