Target
Aldehyde oxidase 1
Ligand
BDBM4078
Substrate
Meas. Tech.
AO Enzyme Assay
pH
7±n/a
Ki
4.53e+3± 4.3e+2 nM
IC50
1.45e+4±n/a nM
Comments
extracted
Citation
 Siah, MFarzaei, MHAshrafi-Kooshk, MRAdibi, HArab, SSRashidi, MRKhodarahmi, R Inhibition of guinea pig aldehyde oxidase activity by different flavonoid compounds: An in vitro study. Bioorg Chem 64:74-84 (2016)  
Target
Name:
Aldehyde oxidase 1
Synonyms:
AO AOXA_CAVPO Aldehyde: O2 oxidoreductase
Type:
Protein
Mol. Mass.:
145280.02
Organism:
Cavia porcellus (Guinea pig)
Description:
H9TB17
Residue:
1332
  
Inhibitor
Name:
BDBM4078
Synonyms:
6,7,13,14-tetrahydroxy-2,9-dioxatetracyclo[6.6.2.0^{4,16}.0^{11,15}]hexadeca-1(14),4(16),5,7,11(15),12-hexaene-3,10-dione ELLAGIC ACID Ellagic acid (18) MLS000069632 cid_5281855
Type:
Small organic molecule
Emp. Form.:
C14H6O8
Mol. Mass.:
302.1926
SMILES:
Oc1cc2c3c(oc(=O)c4cc(O)c(O)c(oc2=O)c34)c1O
: