Target
Adenosine receptor A3 [I248L]
Ligand
BDBM175374
Substrate
Meas. Tech.
Radioligand Binding Assay
Ki
1.01e+4±n/a nM
Citation
 Yadav, RBansal, RRohilla, SKachler, SKlotz, KN Synthesis and pharmacological characterization of novel xanthine carboxylate amides as A2A adenosine receptor ligands exhibiting bronchospasmolytic activity. Bioorg Chem 65:26-37 (2016)  
Target
Name:
Adenosine receptor A3 [I248L]
Synonyms:
AA3R_HUMAN Adenosine receptor A3 | Adenosine receptor A3 (A3)
Type:
Protein
Mol. Mass.:
36197.32
Organism:
Homo sapiens (Human)
Description:
P0DMS8[I248L]
Residue:
318
  
Inhibitor
Name:
BDBM175374
Synonyms:
1,3-Dimethyl-8-[4-{2-(1-methylpiperazin-4-yl)-2-oxoethoxy}-phenyl]xanthine (13g, RB-425)
Type:
Small organic molecule
Emp. Form.:
C20H26N6O4
Mol. Mass.:
414.4582
SMILES:
CN1CCN(CC1)C(=O)COc1ccc(cc1)C1=NC2C(N1)C(=O)N(C)C(=O)N2C
: