Target
Cannabinoid receptor 2
Ligand
BDBM176635
Substrate
Meas. Tech.
Binding Assay
IC50
27±n/a nM
Citation
 Arnaud, JArtiaga, MBarth, FHortala, LMartinez, SRoux, P 1,3,5-triazine-2-amine derivatives, preparation thereof and diagnostic and therapeutic use thereof US Patent  US9115121 Publication Date 8/25/2015 
Target
Name:
Cannabinoid receptor 2
Synonyms:
CANNABINOID CB2 CB2 CB2B CNR2_HUMAN Cannabinoid CB2 receptor Cannabinoid receptor 2 (CB2R) | hCB2
Type:
G Protein-Coupled Receptor (GPCR)
Mol. Mass.:
39690.94
Organism:
Homo sapiens (Human)
Description:
P34972
Residue:
360
  
Inhibitor
Name:
BDBM176635
Synonyms:
US9115121, 27
Type:
Small organic molecule
Emp. Form.:
C20H18FN5O
Mol. Mass.:
363.3882
SMILES:
COc1nc(NCCc2ccc(F)cc2)nc(n1)-c1cccc2[nH]ccc12
: