Target
Plasminogen activator inhibitor 1
Ligand
BDBM175546
Substrate
Meas. Tech.
Fluorometric Plate Assay
pH
7.8±n/a
Temperature
296.15±n/a K
IC50
50±n/a nM
Comments
extracted
Citation
 Lawrence, DAEmal, CCale, JSu, EJWarnock, MLi, SCupp, JA Plasminogen activator inhibitor-1 inhibitors and methods of use thereof to modulate lipid metabolism US Patent  US9120744 Publication Date 9/1/2015 
Target
Name:
Plasminogen activator inhibitor 1
Synonyms:
Endothelial plasminogen activator inhibitor PAI-1 PAI1_HUMAN Plasminogen activator inhibitor 1 Plasminogen activator inhibitor-1 SERPINE1
Type:
Enzyme
Mol. Mass.:
45064.00
Organism:
Homo sapiens (Human)
Description:
P05121
Residue:
402
  
Inhibitor
Name:
BDBM175546
Synonyms:
US9120744, CDE-061
Type:
Small organic molecule
Emp. Form.:
C20H20O10
Mol. Mass.:
420.3668
SMILES:
Oc1cc(cc(O)c1O)C(=O)O[C@H]1CC[C@H](CC1)OC(=O)c1cc(O)c(O)c(O)c1
: