Target
Sodium channel protein type 9 subunit alpha
Ligand
BDBM176480
Substrate
Meas. Tech.
FLIPR or FLIPRTETRA Sodium Dye with KCl Assay
Temperature
310.15±n/a K
IC50
390±80 nM
Comments
extracted
Citation
 Kyle, DJNi, CPark, MTafesse, L Pyridine compounds as sodium channel blockers US Patent  US9120752 Publication Date 9/1/2015 
Target
Name:
Sodium channel protein type 9 subunit alpha
Synonyms:
NENA Peripheral sodium channel 1 SCN9A_HUMAN Voltage-gated sodium channel subunit Nav1.7 hNE-Na
Type:
Protein
Mol. Mass.:
226375.97
Organism:
Homo sapiens (Human)
Description:
Q15858
Residue:
1988
  
Inhibitor
Name:
BDBM176480
Synonyms:
US9120752, 21 | US9765029, 21
Type:
Small organic molecule
Emp. Form.:
C21H20FN3O4S
Mol. Mass.:
429.465
SMILES:
CS(=O)(=O)NCCNC(=O)c1cccc(n1)-c1ccc(Oc2ccc(F)cc2)cc1
: