Target
Sodium channel protein type 9 subunit alpha
Ligand
BDBM176517
Substrate
Meas. Tech.
FLIPR or FLIPRTETRA Sodium Dye with KCl Assay
Temperature
310.15±n/a K
IC50
5940±730 nM
Comments
extracted
Citation
 Kyle, DJNi, CPark, MTafesse, L Pyridine compounds as sodium channel blockers US Patent  US9120752 Publication Date 9/1/2015 
Target
Name:
Sodium channel protein type 9 subunit alpha
Synonyms:
NENA Peripheral sodium channel 1 SCN9A_HUMAN Voltage-gated sodium channel subunit Nav1.7 hNE-Na
Type:
Protein
Mol. Mass.:
226375.97
Organism:
Homo sapiens (Human)
Description:
Q15858
Residue:
1988
  
Inhibitor
Name:
BDBM176517
Synonyms:
US9120752, 55 | US9765029, 55
Type:
Small organic molecule
Emp. Form.:
C23H19FN4O4S
Mol. Mass.:
466.485
SMILES:
Fc1ccc(Oc2cccc(n2)C(=O)N2CCN(CC2)S(=O)(=O)c2cccc(c2)C#N)cc1
: