Target
Transient receptor potential cation channel subfamily V member 1
Ligand
BDBM176555
Substrate
Meas. Tech.
FLIPR Assay
Ki
0.1±n/a nM
Citation
 Frank, RBahrenberg, GChristoph, TSchiene, KDe Vry, JDamann, NFrormann, SLesch, BLee, JKim, YKim, MSaunders, DStockhausen, H Substituted phenylureas and phenylamides as vanilloid receptor ligands US Patent  US9120756 Publication Date 9/1/2015 
Target
Name:
Transient receptor potential cation channel subfamily V member 1
Synonyms:
Capsaicin receptor TRPV1_RAT Trpv1 Vanilloid VR1 Vanilloid receptor 1 (VRI/TRPV1) Vanilloid receptor type 1-like (TrpV1/Vr1) Vr1l | osm-9-like TRP channel 1
Type:
Transient Receptor
Mol. Mass.:
94956.12
Organism:
Rattus norvegicus (rat)
Description:
O35433
Residue:
838
  
Inhibitor
Name:
BDBM176555
Synonyms:
US9120756, 17
Type:
Small organic molecule
Emp. Form.:
C24H28ClFN4O3S
Mol. Mass.:
507.021
SMILES:
C[C@H](C(=O)NCc1cc(nn1-c1cccc(Cl)c1)C(C)(C)C)c1ccc(NS(C)(=O)=O)c(F)c1
: