Target
Cytochrome P450 3A4
Ligand
BDBM50241361
Substrate
Meas. Tech.
IC50
>10000±n/a nM
Citation
 Bareja, SPJones, SDOblong, JEMills, KJBierman, JC Cosmetic compositions containing substituted azole and methods for improving the appearance of aging skin US Patent  US9138393 Publication Date 9/22/2015 
Target
Name:
Cytochrome P450 3A4
Synonyms:
Albendazole monooxygenase CP3A4_HUMAN CYP3A4 CYPIIIA4 Cytochrome P450 3A4 (CYP3A4) Nifedipine oxidase Taurochenodeoxycholate 6-alpha-hydroxylase
Type:
Enzyme
Mol. Mass.:
57349.57
Organism:
Homo sapiens (Human)
Description:
Residue:
503
  
Inhibitor
Name:
BDBM50241361
Synonyms:
CHEMBL1515 US9138393, Methimazole | US9144538, Methimazole
Type:
Small organic molecule
Emp. Form.:
C4H6N2S
Mol. Mass.:
114.169
SMILES:
Cn1cc[nH]c1=S
: