Target
Leucine-rich repeat serine/threonine-protein kinase 2
Ligand
BDBM60656
Substrate
Meas. Tech.
In vitro LRRK2 Lanthascreen Binding Assay
Ki
8±n/a nM
Citation
 Baker-Glenn, CChambers, MChan, BKEstrada, AShore, DSweeney, ZKChen, H Aminopyrimidine derivatives as LRRK2 modulators US Patent  US9145402 Publication Date 9/29/2015 
Target
Name:
Leucine-rich repeat serine/threonine-protein kinase 2
Synonyms:
Dardarin LRRK2_HUMAN Leucine-rich repeat serine/threonine-protein kinase 2 PARK8
Type:
Protein
Mol. Mass.:
286113.20
Organism:
Homo sapiens (Human)
Description:
Q5S007
Residue:
2527
  
Inhibitor
Name:
BDBM60656
Synonyms:
US9145402, 4
Type:
Emp. Form.:
C15H11F6N5O
Mol. Mass.:
391.2712
SMILES:
CNc1nc(Nc2c(OC)cc(cc2C(F)(F)F)C#N)ncc1C(F)(F)F
: