Target
Leucine-rich repeat serine/threonine-protein kinase 2
Ligand
BDBM182714
Substrate
Meas. Tech.
In vitro LRRK2 Lanthascreen Binding Assay
Ki
4±n/a nM
Citation
 Baker-Glenn, CChambers, MChan, BKEstrada, AShore, DSweeney, ZKChen, H Aminopyrimidine derivatives as LRRK2 modulators US Patent  US9145402 Publication Date 9/29/2015 
Target
Name:
Leucine-rich repeat serine/threonine-protein kinase 2
Synonyms:
Dardarin LRRK2_HUMAN Leucine-rich repeat serine/threonine-protein kinase 2 PARK8
Type:
Protein
Mol. Mass.:
286113.20
Organism:
Homo sapiens (Human)
Description:
Q5S007
Residue:
2527
  
Inhibitor
Name:
BDBM182714
Synonyms:
US9145402, 21
Type:
Small organic molecule
Emp. Form.:
C19H22F5N5O2
Mol. Mass.:
447.4023
SMILES:
CNc1nc(Nc2cc(F)c(CN3CCOCC3)cc2OCCF)ncc1C(F)(F)F
: