Target
Isoform Alpha-4-2 of Neuronal acetylcholine receptor subunit alpha-4 (Alpha-4-2)
Ligand
BDBM50395220
Substrate
Meas. Tech.
Inhibition Assay
Ki
0.082±n/a nM
Citation
 Carroll, FIOndachi, PWNavarro, HADamaj, MIWoods, JHJutkiewicz, EM Nicotinic receptor compounds US Patent  US9150581 Publication Date 10/6/2015 
Target
Name:
Isoform Alpha-4-2 of Neuronal acetylcholine receptor subunit alpha-4 (Alpha-4-2)
Synonyms:
ACHA4_RAT Chrna4 Neuronal acetylcholine receptor subunit alpha-4 (Alpha-4-2) | Neuronal acetylcholine receptor subunit alpha-4 beta 2
Type:
Enzyme
Mol. Mass.:
70323.63
Organism:
Rattus norvegicus (Rat)
Description:
P09483-2
Residue:
631
  
Inhibitor
Name:
BDBM50395220
Synonyms:
CHEMBL2164664 | US9150581, RTI-7527-(+/-)-154
Type:
Small organic molecule
Emp. Form.:
C18H19FN2O2S
Mol. Mass.:
346.419
SMILES:
CS(=O)(=O)c1ccc(cc1)-c1cc(cnc1F)C1CC2CCC1N2
: