Target
Glycylpeptide N-tetradecanoyltransferase
Ligand
BDBM185055
Substrate
Meas. Tech.
Enzyme Inhibition Assay
pH
7.4±n/a
Temperature
298.15±n/a K
IC50
2±n/a nM
Comments
extracted
Citation
 Brand, SWyatt, PThompson, SSmith, VBayliss, THarrison, JNorcross, NCleghorn, LGilbert, IBrenk, R N-myristoyl transferase inhibitors US Patent  US9156811 Publication Date 10/13/2015 
Target
Name:
Glycylpeptide N-tetradecanoyltransferase
Synonyms:
N-myristoyltransferase (NMT1)
Type:
Protein
Mol. Mass.:
50529.16
Organism:
Trypanosoma brucei
Description:
Q388H8
Residue:
446
  
Inhibitor
Name:
BDBM185055
Synonyms:
US9156811, DDD100097
Type:
Small organic molecule
Emp. Form.:
C22H30Cl2F2N4O2S
Mol. Mass.:
523.467
SMILES:
CN1CCC(CCCc2cc(Cl)c(c(Cl)c2)[S+]([O-])(=O)N(C(F)F)c2c(C)nn(C)c2C)CC1
: