Target
Glycylpeptide N-tetradecanoyltransferase
Ligand
BDBM185083
Substrate
Meas. Tech.
Enzyme Inhibition Assay
pH
7.4±n/a
Temperature
298.15±n/a K
IC50
1±n/a nM
Comments
extracted
Citation
 Brand, SWyatt, PThompson, SSmith, VBayliss, THarrison, JNorcross, NCleghorn, LGilbert, IBrenk, R N-myristoyl transferase inhibitors US Patent  US9156811 Publication Date 10/13/2015 
Target
Name:
Glycylpeptide N-tetradecanoyltransferase
Synonyms:
Glycylpeptide N-tetradecanoyltransferase | N-myristoyltransferase (NMT1)
Type:
Protein
Mol. Mass.:
48514.36
Organism:
Leishmania major
Description:
Q4Q5S8
Residue:
421
  
Inhibitor
Name:
BDBM185083
Synonyms:
US9156811, DDD100169
Type:
Small organic molecule
Emp. Form.:
C22H30Cl2F2N4O3S
Mol. Mass.:
539.466
SMILES:
CN1CCC(CC1)OCCCc1cc(Cl)c(c(Cl)c1)[S+]([O-])(=O)N(C(F)F)c1c(C)nn(C)c1C
: