Target
Phosphatidylinositol 4,5-bisphosphate 3-kinase catalytic subunit delta isoform
Ligand
BDBM185354
Substrate
Meas. Tech.
In Vitro Enzyme Inhibition Assay
Temperature
298.15±n/a K
IC50
12±n/a nM
Comments
extracted
Citation
 Barlaam, BCDelouvrie, BOuvry, GLambert-Van Der Brempt, CMHarris, CSBerry, DTomkinson, GPReid, GP Chemical compounds US Patent  US9156831 Publication Date 10/13/2015 
Target
Name:
Phosphatidylinositol 4,5-bisphosphate 3-kinase catalytic subunit delta isoform
Synonyms:
PI3-kinase p110 subunit delta PI3-kinase subunit p110-delta PIK3CD Phosphatidylinositol 4,5-biphosphate 3-kinase catalytic subunit delta (PIK3CD) Phosphatidylinositol 4,5-bisphosphate 3-kinase 110 kDa catalytic subunit delta (PI3K delta) Phosphatidylinositol 4,5-bisphosphate 3-kinase catalytic subunit delta (PI3Kdelta) Phosphatidylinositol 4,5-bisphosphate 3-kinase catalytic subunit delta isoform (PI3K delta) Phosphatidylinositol 4,5-bisphosphate 3-kinase catalytic subunit delta isoform (PI3K-delta) Phosphatidylinositol 4,5-bisphosphate 3-kinase catalytic subunit delta isoform (PI3Kdelta)
Type:
Enzyme Subunit
Mol. Mass.:
119489.41
Organism:
Homo sapiens (Human)
Description:
O00329
Residue:
1044
  
Inhibitor
Name:
BDBM185354
Synonyms:
US9156831, 5
Type:
Small organic molecule
Emp. Form.:
C22H31N9O3
Mol. Mass.:
469.54
SMILES:
C[C@H](O)CC(=O)N1CCC(CC1)c1nc(-c2cnc(N)c(n2)-c2nnc(o2)C(C)(C)C)n(C)n1
: