Target
5-hydroxytryptamine receptor 2A
Ligand
BDBM186929
Substrate
Meas. Tech.
Radioligand Binding Assay
pH
7.4±n/a
Ki
3584±n/a nM
Comments
extracted
Citation
 Besnard, JHopkins, ALGilbert, IRuda, GFAbecassis, K Morpholino compounds, uses and methods US Patent  US9079895 Publication Date 7/14/2015 
Target
Name:
5-hydroxytryptamine receptor 2A
Synonyms:
5-HT-2 5-hydroxytryptamine receptor 2A 5HT2A_MOUSE Htr2 Serotonin 2a (5-HT2a) receptor
Type:
Enzyme
Mol. Mass.:
52843.00
Organism:
Mus musculus (Mouse)
Description:
P35363
Residue:
471
  
Inhibitor
Name:
BDBM186929
Synonyms:
US9079895, 21r
Type:
Small organic molecule
Emp. Form.:
C20H25N3O2
Mol. Mass.:
339.4314
SMILES:
C(CN1CCO[C@@H](COc2cccnc2)C1)N1CCc2ccccc12
: