Target
5-hydroxytryptamine receptor 2A
Ligand
BDBM186936
Substrate
Meas. Tech.
Radioligand Binding Assay
pH
7.4±n/a
Ki
1945±n/a nM
Comments
extracted
Citation
 Besnard, JHopkins, ALGilbert, IRuda, GFAbecassis, K Morpholino compounds, uses and methods US Patent  US9079895 Publication Date 7/14/2015 
Target
Name:
5-hydroxytryptamine receptor 2A
Synonyms:
5-HT-2 5-hydroxytryptamine receptor 2A 5HT2A_MOUSE Htr2 Serotonin 2a (5-HT2a) receptor
Type:
Enzyme
Mol. Mass.:
52843.00
Organism:
Mus musculus (Mouse)
Description:
P35363
Residue:
471
  
Inhibitor
Name:
BDBM186936
Synonyms:
US9079895, 24s
Type:
Small organic molecule
Emp. Form.:
C22H26N2O4
Mol. Mass.:
382.4528
SMILES:
COc1cccc(OC[C@@H]2CN(CC(=O)N3CCc4ccccc34)CCO2)c1
: