Target
D(2) dopamine receptor
Ligand
BDBM186927
Substrate
Meas. Tech.
Radioligand Binding Assay
pH
7.4±n/a
Ki
342±n/a nM
Comments
extracted
Citation
 Besnard, JHopkins, ALGilbert, IRuda, GFAbecassis, K Morpholino compounds, uses and methods US Patent  US9079895 Publication Date 7/14/2015 
Target
Name:
D(2) dopamine receptor
Synonyms:
DOPAMINE D2 Dopamine D2 receptor Drd2
Type:
Enzyme
Mol. Mass.:
50957.64
Organism:
Mus musculus (Mouse)
Description:
P61168
Residue:
444
  
Inhibitor
Name:
BDBM186927
Synonyms:
US9079895, 19s
Type:
Small organic molecule
Emp. Form.:
C21H26N2O2
Mol. Mass.:
338.4433
SMILES:
C(CN1CCO[C@H](COc2ccccc2)C1)N1CCc2ccccc12
: